DOE/LANL/TTD
in scheme: providers
definition: Tech Transfer Division The Laboratory's Technology Transfer Division helps move technologies from the Lab to the marketplace to benefit society and the U.S. economy. We do this by ensuring that Laboratory inventions receive intellectual property protection, which enables us to license Los Alamos technologies to industry and start-up companies. As the Laboratory's liaison with industry, we also manage Lab-industry research partnerships and serve as the Laboratory's resource on industry relations. Summary provided by http://www.lanl.gov/partnerships/
type: Concept

DOE
type: Concept