USDA/CSREES/AES/UC-DAVIS
in scheme: providers
definition: The UC Davis College of Agricultural and Environmental Sciences conducts research on critical issues that mpact agriculture, the environment, and people in California and around the world. Website: "http://www.aes.ucdavis.edu/" [Summary provided by UC Davis.]
type: Concept

USDA
type: Concept