CONFLUENCIA_WEDDELL-SCOTIA
in scheme: projects
definition: CONFLUENCIA WWEDDELL-SCOTIA The proposed program will focus on quantifying both the deep boundary currents and the overlying mixing processes which combine to transfer Weddell Sea waters northward through the WSC.
type: Concept

A - C
type: Concept