STRATIGRAPHIC SEQUENCE
change note: 2017-03-10 08:01:05.0 [tstevens] update Definition (A chronological succession of sedimentary rocks from older to younger above; essentially without interruption.);
change note: 2017-03-10 08:00:52.0 [tstevens] update Definition (A chronological succession of sedimentary rocks from older to younger above;essentially without interruption.); update Definition (Dictionary of Geological Terms, American Geological Institute, 1984. );
in scheme: sciencekeywords
definition: A chronological succession of sedimentary rocks from older to younger above; essentially without interruption.
type: Concept

EROSION/SEDIMENTATION
type: Concept