BURNED AREA
change note: 2016-03-30 14:13:27.0 [gee-cee] update PrefLabel (BURNED AREA); insert Definition (id: null text: Characterized by deposits of charcoal and ash, removal of vegetation, and alteration of the vegetation structure, Pereira et al. 1997, Roy et al. 1999 language code: en);
change note: 2016-03-30 14:10:55.0 [gee-cee] Insert Concept add broader relation (Burned Area [436b098d-e4d9-4fbd-9ede-05675e111eee,158719] - WILDFIRES [868b87a1-d8c2-49b3-8bbd-9cbbed115271,86199]);
in scheme: sciencekeywords
definition: Characterized by deposits of charcoal and ash, removal of vegetation, and alteration of the vegetation structure, Pereira et al. 1997, Roy et al. 1999
type: Concept

WILDFIRES
type: Concept