MARINE ENVIRONMENT MONITORING
type: Concept

ENFORCEMENT
change note: 2021-10-19 09:09:02.0 [tstevens] insert Definition (id: null text: Enforcement operations (by aircrafts, UAVs, etc.) using thermal imagery, survey, and radar to support enforcement of marine sanctuary regulations and protection of it's resources. language code: en);
change note: 2021-10-19 09:08:13.0 [tstevens] Insert Concept add broader relation (ENFORCEMENT [43763945-ceea-4716-8e77-068393300a7e,778197] - MARINE ENVIRONMENT MONITORING [ca154e02-a226-4cc7-8e4a-4474e7eb1eeb,775225]);
in scheme: sciencekeywords
definition: Enforcement operations (by aircrafts, UAVs, etc.) using thermal imagery, survey, and radar to support enforcement of marine sanctuary regulations and protection of it's resources.
type: Concept