MT/MSL/NRIS/GIS
in scheme: providers
definition: The Montana Natural Resource Information System Geographic Information System (GIS) acts as a clearinghouse for GIS databases and provides services to State, Federal, Private, Non-Profit, and Public groups or individuals needing access to GIS technology. Website: "http://geoinfo.msl.mt.gov/Home/geography/water_information_system" [Summary provided by the Montana Natural Resource Information System]
type: Concept

MONTANA
type: Concept