INSECTS
in scheme: sciencekeywords
definition: Insects are a class of Arthropoda, members of which have three pairs of legs and usually two pairs of wings borne on the thorax.
type: Concept

HEXAPODS
type: Concept