MULTINATIONAL ORGANIZATIONS
type: Concept

UNESCO/WHC
change note: 2013-02-28 11:08:03.0 [tbs1979] Insert Concept add broader relation (UNESCO/WHC [450ebf35-951f-45ec-aa6f-feb9429e2bc1,82715] - MULTINATIONAL ORGANIZATIONS [756a90f8-4203-46f1-87e9-9e0d64bdee50,66455]);
in scheme: providers
definition: The United Nations Educational, Scientific and Cultural Organization (UNESCO) seeks to encourage the identification, protection and preservation of cultural and natural heritage around the world considered to be of outstanding value to humanity. This is embodied in an international treaty called the Convention concerning the Protection of the World Cultural and Natural Heritage , adopted by UNESCO in 1972. UNESCO's World Heritage mission is to: - encourage countries to sign the World Heritage Convention and to ensure the protection of their natural and cultural heritage; - encourage States Parties to the Convention to nominate sites within their national territory for inclusion on the World Heritage List; - encourage States Parties to establish management plans and set up reporting systems on the state of conservation of their World Heritage sites; - help States Parties safeguard World Heritage properties by providing technical assistance and professional training; - provide emergency assistance for World Heritage sites in immediate danger; - support States Parties' public awareness-building activities for World Heritage conservation; - encourage participation of the local population in the preservation of their cultural and natural heritage; - encourage international cooperation in the conservation of our world's cultural and natural heritage.
type: Concept