MFR-7
change note: 2021-08-09 15:19:49.0 [tstevens] insert AltLabel (id: null category: primary text: Multifilter Rotating Shadowband Radiometer language code: en); insert Definition (id: null text: The Multifilter Rotating Shadowband Radiometer (MFR-7) is a field instrument that measures the global, direct, and diffuse components of solar irradiance at up to seven wavelengths. A microprocessor- controlled shadowband alternately shades and exposes the instrument diffuser, enabling the system to measure all three irradiance components with only one detector. In addition to a broadband channel, this instrument has six narrowband channels. language code: en);
change note: 2021-08-09 15:17:37.0 [tstevens] Insert Concept add broader relation (MFR-7 [45baca7f-18fc-4811-8fd9-015c395e0300,706563] - Spectrometers/Radiometers [ecd58f82-8f96-45e1-9547-dd4a02291bd9,699353]);
in scheme: instruments
definition: The Multifilter Rotating Shadowband Radiometer (MFR-7) is a field instrument that measures the global, direct, and diffuse components of solar irradiance at up to seven wavelengths. A microprocessor- controlled shadowband alternately shades and exposes the instrument diffuser, enabling the system to measure all three irradiance components with only one detector. In addition to a broadband channel, this instrument has six narrowband channels.
type: Concept

Spectrometers/Radiometers
type: Concept