DOI/USGS/BRD/FRESC
change note: 2013-11-27 11:07:18.0 [epneff] Correct mistakes in Definition text update Definition (The Forest and Rangeland Ecosystem Science Center (FRESC) mission is to provide scientific understanding and technology to support sound management and the conservation of natural resources. FRESC is a fairly young company, but organizations merged into to FRESC date back to nearly 30 years. Having organizations join FRESC enhances its leadership role in developing innovative approaches to highly integrated research through close working relationships with universities, and research institutions. FRESC plans to maintain its reputation for developing science-based monitoring systems and conducting world-class research. Website: "http://fresc.usgs.gov/" [Summary provided by the USGS.]);
in scheme: providers
definition: The Forest and Rangeland Ecosystem Science Center (FRESC) mission is to provide scientific understanding and technology to support sound management and the conservation of natural resources. FRESC is a fairly young company, but organizations merged into to FRESC date back to nearly 30 years. Having organizations join FRESC enhances its leadership role in developing innovative approaches to highly integrated research through close working relationships with universities, and research institutions. FRESC plans to maintain its reputation for developing science-based monitoring systems and conducting world-class research. Website: "http://fresc.usgs.gov/" [Summary provided by the USGS.]
type: Concept

USGS
type: Concept