DOE/LLNL/ICC/SDD/IMG
in scheme: providers
definition: The IMG group develops and supports tools for managing, visualizing, and presenting scientific data. Our services include consulting on scientific visualization packages and graphics utilities, authoring and production of videotapes and DVDs, and support for Access Grid Node and PowerWall facilities. Our development work includes graphic support projects with commercial visualization packages, and two projects to support Visual Interactive Environment for Weapons Simulation (VIEWS): Visualization and Scientific Data Management. Summary provided by https://computation.llnl.gov/icc/sdd/img/
type: Concept

DOE
type: Concept