DE/CLIM
change note: 2019-06-04 11:55:47.0 [sritz] update Definition (The Delaware State Climatologist Office provides real-time weather data, Delaware climate data and informative links for the Citizens of Delaware. Website: http://climate.udel.edu [Summary provided by the University of Delaware.]); update Resource (provider); update Resource (http://climate.udel.edu);
in scheme: providers
definition: The Delaware State Climatologist Office provides real-time weather data, Delaware climate data and informative links for the Citizens of Delaware. Website: http://climate.udel.edu [Summary provided by the University of Delaware.]
type: Concept

DELAWARE
type: Concept