PASTURE
change note: 2016-06-15 08:06:39.0 [gee-cee] insert Definition (id: null text: Pertaining to land managed primarily for the production of introduced forage plants for livestock grazing. language code: en);
change note: 2016-06-15 08:06:17.0 [gee-cee] Insert Concept add broader relation (PASTURE [46a26fc7-95f0-409e-8bfa-eb623b3a3f8d,188271] - AGRICULTURAL LANDS [38fb609b-2a10-4d4f-b2e8-7e51161ec974,85167]);
in scheme: sciencekeywords
definition: Pertaining to land managed primarily for the production of introduced forage plants for livestock grazing.
type: Concept

AGRICULTURAL LANDS
type: Concept