ARCTIC TUNDRA
change note: 2016-06-13 10:06:28.0 [gee-cee] insert Definition (id: null text: Pertaining to tundra found north of the Arctic Circle. language code: en);
change note: 2016-06-13 10:05:59.0 [gee-cee] Insert Concept add broader relation (ARCTIC TUNDRA [46ecf46f-a710-4589-82b2-34aebf35c3c0,188169] - ALPINE/TUNDRA [76589134-8d93-4e45-8476-f04497181d14,84967]);
in scheme: sciencekeywords
definition: Pertaining to tundra found north of the Arctic Circle.
type: Concept

ALPINE/TUNDRA
type: Concept