Particle Detectors
type: Concept

SPEA
in scheme: instruments
definition: A hemispherical electrostatic analyzer measured the directional intensity of positive ions and electrons in the solar wind, magnetosheath, and magnetotail. Ions as heavy as oxygen were resolved when the solar wind temperature was low. Energy analysis was accomplished by charging the plates to known voltage levels and allowing them to discharge with known RC time constants. In the solar wind, positive ions from 200 eV to 5 keV (15% spacing, 3% resolution) and electrons from 5 eV to 1 keV (30% spacing, 15% resolution) were studied. In the magnetosheath, positive ions from 200 eV to 5 keV (15% spacing, 3% resolution) and from 200 eV to 20 keV (30% spacing, 15% resolution) and electrons from 5 eV to 1 keV (30% spacing, 15% resolution) were studied. In the magnetotail, positive ions from 200 eV to 20 keV (30% spacing, 15% resolution) and electrons from 5 eV to 1 keV (30% spacing, 15% resolution) and from 100 eV to 20 keV (15% resolution) were studied. For further details see W. C. Feldman et al., J. Geophys., v. 80, p. 4181, 1975. See: http://nssdc.gsfc.nasa.gov/database/MasterCatalog?sc=1973-078A&ex=10
type: Concept