HYPSOMETERS
in scheme: instruments
definition: HYPSOMETERS are instruments for measuring height; specifically for measuring atmospheric pressure by determining the boiling point of a liquid at the station; used in high altitudes because of its increased sensitivity when pressure decreases; frequently used for height estimation.
type: Concept

Hypsometers
type: Concept