ANIMALS/INVERTEBRATES
type: Concept

LORICIFERANS
change note: 2017-03-13 14:13:52.0 [mgenazzi] Definition added insert Definition (id: null text: Phylum Loricifera are microscopic bilateral animals characterized by a lorica and habitat between marine sediments language code: en);
in scheme: sciencekeywords
definition: Phylum Loricifera are microscopic bilateral animals characterized by a lorica and habitat between marine sediments
type: Concept