M - O
type: Concept

OCO
change note: 2020-05-22 11:48:36.0 [sritz] update Definition ([Source: https://oco.jpl.nasa.gov/ ] The Orbiting Carbon Observatory-2 (OCO-2) is based on the original OCO mission that was developed under the NASA Earth System Science Pathfinder (ESSP) Program Office and launched from Vandenberg Air Force Base on February 24, 2009. Before spacecraft separation, a launch vehicle anomaly occurred that prevented the OCO spacecraft from reaching injection orbit. The spacecraft was destroyed during re-entry. The Orbiting Carbon Observatory-2 (OCO-2) mission was authorized to enter a tailored formulation phase on March 8, 2010. As outlined in the Formulation Authorization Document, the OCO-2 Project is directed to make every effort “to duplicate the original OCO design using identical hardware, drawings, documents, procedures, and software wherever possible and practical” to minimize cost risk, schedule risk, and performance risk. For more information: https://oco.jpl.nasa.gov/);
change note: 2020-05-22 11:45:02.0 [sritz] update Definition ([Source: https://oco.jpl.nasa.gov/ ] The Orbiting Carbon Observatory -2 (OCO-2) is based on the original OCO mission that was developed under the NASA Earth System Science Pathfinder (ESSP) Program Office and launched from Vandenberg Air Force Base on February 24, 2009. Before spacecraft separation, a launch vehicle anomaly occurred that prevented the OCO spacecraft from reaching injection orbit. The spacecraft was destroyed during re-entry. The Orbiting Carbon Observatory-2 (OCO-2) mission was authorized to enter a tailored formulation phase on March 8, 2010. As outlined in the Formulation Authorization Document, the OCO-2 Project is directed to make every effort “to duplicate the original OCO design using identical hardware, drawings, documents, procedures, and software wherever possible and practical” to minimize cost risk, schedule risk, and performance risk. For more information: https://oco.jpl.nasa.gov/); update Definition (https://oco.jpl.nasa.gov/);
change note: 2021-10-26 14:07:56.0 [sritz] update Definition (The Orbiting Carbon Observatory-2 (OCO-2) is based on the original OCO mission that was developed under the NASA Earth System Science Pathfinder (ESSP) Program Office and launched from Vandenberg Air Force Base on February 24, 2009. Before spacecraft separation, a launch vehicle anomaly occurred that prevented the OCO spacecraft from reaching injection orbit. The spacecraft was destroyed during re-entry. The Orbiting Carbon Observatory-2 (OCO-2) mission was authorized to enter a tailored formulation phase on March 8, 2010. As outlined in the Formulation Authorization Document, the OCO-2 Project is directed to make every effort “to duplicate the original OCO design using identical hardware, drawings, documents, procedures, and software wherever possible and practical” to minimize cost risk, schedule risk, and performance risk. For more information: https://ocov2.jpl.nasa.gov/); update Definition (Source: https://ocov2.jpl.nasa.gov/);
definition: The Orbiting Carbon Observatory-2 (OCO-2) is based on the original OCO mission that was developed under the NASA Earth System Science Pathfinder (ESSP) Program Office and launched from Vandenberg Air Force Base on February 24, 2009. Before spacecraft separation, a launch vehicle anomaly occurred that prevented the OCO spacecraft from reaching injection orbit. The spacecraft was destroyed during re-entry. The Orbiting Carbon Observatory-2 (OCO-2) mission was authorized to enter a tailored formulation phase on March 8, 2010. As outlined in the Formulation Authorization Document, the OCO-2 Project is directed to make every effort “to duplicate the original OCO design using identical hardware, drawings, documents, procedures, and software wherever possible and practical” to minimize cost risk, schedule risk, and performance risk. For more information: https://ocov2.jpl.nasa.gov/
type: Concept
in scheme: projects