Surface
type: Concept

Okeanos Explorer
change note: 2021-11-18 09:35:10.0 [tstevens] Move Concepts delete broader relation (null); add broader relation (Okeanos Explorer [4838472f-2b4c-4107-bd9e-3bf78a7c5562,826211] - Surface [59b97a6c-385e-40a2-8422-ecbdb6023c4c,835900]);
change note: 2019-11-19 15:57:24.0 [sritz] update AltLabel (NOAA Ship Okeanos Explorer);
change note: 2019-08-28 12:08:27.0 [sritz] insert AltLabel (id: null category: primary text: OKEANOS Explorer language code: en);
change note: 2019-08-28 11:57:41.0 [sritz] Insert Concept add broader relation (Okeanos [4838472f-2b4c-4107-bd9e-3bf78a7c5562,369077] - SHIPS [82a67b12-e99d-4c90-8a6a-a6f79d4c3c7b,345297]);
change note: 2019-08-28 12:09:05.0 [sritz] update AltLabel (Okeanos Explorer);
change note: 2019-08-28 12:03:07.0 [sritz] insert Definition (id: null text: NOAA Ship Okeanos Explorer is the only federal vessel dedicated to exploring our largely unknown ocean for the purpose of discovery and the advancement of knowledge about the deep ocean. language code: en);
change note: 2019-11-19 15:55:39.0 [sritz] Rename Concept update PrefLabel (Okeanos Explorer);
change note: 2019-08-28 12:01:09.0 [sritz] update PrefLabel (R/V Okeanos);
in scheme: platforms
definition: NOAA Ship Okeanos Explorer is the only federal vessel dedicated to exploring our largely unknown ocean for the purpose of discovery and the advancement of knowledge about the deep ocean.
type: Concept