M - O
type: Concept

NOPP
in scheme: projects
definition: The National Oceanographic Partnership Program (NOPP) is a collaboration of fifteen federal agencies to provide leadership and coordination of national oceanographic research and education initiatives. NOPP facilitates interactions among federal agencies, academia and industry; increases visibility for ocean issues on the national agenda; and achieves a higher level of coordinated effort across the broad oceanographic community. Information provided by http://www.nopp.org/
type: Concept