NON-METALLIC MINERALS
type: Concept

NON-METALLIC MINERAL AGE DETERMINATIONS
change note: 2013-03-21 15:09:21.0 [tbs1979] insert Definition (id: null text: An analysis and determination of the age of non-metallic minerals. language code: en);
change note: 2013-03-05 13:21:42.0 [tbs1979] Insert Concept add broader relation (NON-METALLIC MINERAL AGE DETERMINATIONS [497ec0b6-a732-4d97-9e5a-09eaf5ed4607,83065] - NON-METALLIC MINERALS [d64a9627-3cf8-41d3-aaf7-8c2c46fb4a13,63025]);
in scheme: sciencekeywords
definition: An analysis and determination of the age of non-metallic minerals.
type: Concept