ENDORHERIC BASIN
change note: 2013-04-01 08:37:41.0 [tbs1979] insert Definition (id: null text: A closed drainage basin that retains water and allows no outflow to other bodies of water such as rivers or oceans. language code: en);
change note: 2013-02-18 10:35:17.0 [tbs1979] Insert Concept add broader relation (ENDORHERIC BASIN [4a2a2f6d-9735-4bee-9d1a-21dcd0352c6b,82435] - FLUVIAL LANDFORMS [cb5193ab-2d7a-4b35-b7ec-f16ce78ae270,64131]);
in scheme: sciencekeywords
definition: A closed drainage basin that retains water and allows no outflow to other bodies of water such as rivers or oceans.
type: Concept

FLUVIAL LANDFORMS
type: Concept