USDA
type: Concept

USDA/FS/SR
in scheme: providers
definition: The USDA Forest Service Southern Region provides forest resource management and assessment for the southern United States. Website: "http://www.fs.fed.us/r8/" [Summary provided by the USDA.]
type: Concept