LSU/CSPHIH
in scheme: providers
definition: The LSU Hurricane Public Health Center (HPHC), also known as the Center for the Study of Public Health Impacts of Hurricanes, began multidisciplinary research on public health aspects of hurricanes and major floods in 2002. Summary Provided By: http://www.publichealth.hurricane.lsu.edu/
type: Concept

ACADEMIC
type: Concept