CHANGE DETECTION SERVICES
in scheme: sciencekeywords
definition: Services to find differences between two data sets that represent the same geographical area at different times.
type: Concept

DATA PROCESSING SERVICES
type: Concept