MORBIDITY
type: Concept

MORBIDITY RATES
change note: 2012-06-29 13:25:31.0 [tbs1979] insert Definition (id: null text: An expression of the number of deaths in a population at risk during one year. language code: en);
change note: 2012-06-26 15:21:07.0 [tbs1979] Insert Concept add broader relation (MORBIDITY RATES [4b95ab99-4784-44aa-99f0-ecc677dbda65,40075] - MORBIDITY [8a49484a-a9c8-411b-b911-7646f5323a7b,40073]);
in scheme: sciencekeywords
definition: An expression of the number of deaths in a population at risk during one year.
type: Concept