Profilers/Sounders
type: Concept

IKFS
change note: 2015-08-03 12:44:44.0 [mpmorahan] insert AltLabel (id: null text: IR-Fourier spectrometer language code: en);
change note: 2015-08-03 12:41:18.0 [mpmorahan] Insert Concept add broader relation (IKFS [4bd33158-b070-4673-8f23-772e1d6a47b6,158167] - Profilers/Sounders [4190ebdc-e89a-4f3f-bc74-b2af4c68d009,144765]);
in scheme: instruments
definition: IR-Fourier spectrometer (IKFS) Group: Instrument_Details Entry_ID: IKFS Group: Instrument_Identification Instrument_Category: Earth Remote Sensing Instruments Instrument_Class: Passive Remote Sensing Instrument_Type: Atmospheric temperature and humidity sounders Short_Name: IKFS Long_Name: IR-Fourier spectrometer End_Group Group: Associated_Platforms Short_Name: Meteor-3M Short_Name: Meteor-M N2 End_Group Group: Spectral_Frequency_Information Wavelength_Keyword: Infrared > Thermal Spectral_Frequency_Coverage_Range: 5 µm - 15 µm End_Group Online_Resource: http://www.wmo-sat.info/oscar/instruments/view/559 Creation_Date: 2015-01-26 Group: Instrument_Logistics Instrument_Owner: Russia/ROSCOSMOS End_Group End_Group
type: Concept