DOI/USGS/USANPN
type: Concept
definition: In response to the growing need to understand the response of plant and animal species to environmental variation and climate change and to develop a widespread baseline against which future phenological change may be measured, a consortium of scientists and agencies organized the USA-NPN, with a mandate to collect and share phenology data. More information on the USA-NPN can be found at http://www.usanpn.org/about.
change note: 2014-03-26 10:36:04.0 [epneff] insert Definition (id: null text: In response to the growing need to understand the response of plant and animal species to environmental variation and climate change and to develop a widespread baseline against which future phenological change may be measured, a consortium of scientists and agencies organized the USA-NPN, with a mandate to collect and share phenology data. More information on the USA-NPN can be found at http://www.usanpn.org/about. language code: en);
change note: 2014-03-31 10:09:53.0 [epneff] added alternative label update AltLabel (USA National Phenology Network, U.S. Geological Survey, U.S. Department of Interior);
change note: 2014-03-31 10:10:43.0 [epneff] added alternative label update AltLabel (USA National Phenology Network, U.S. Geological Survey, U.S. Department of the Itnterior);
change note: 2014-03-31 10:08:57.0 [epneff] added alternative label insert AltLabel (id: null text: USA National Phenology Network, US Geological Survey, Department of Interior language code: en);
change note: 2014-03-26 10:33:27.0 [epneff] Insert Concept add broader relation (DOI/USGS/USANPN [4c29846a-c11b-486f-95b1-ae8fdb44e78f,106253] - USGS [5fea4160-25a7-44b5-bfba-ef140fdffaf4,66487]);
change note: 2014-03-31 10:12:13.0 [epneff] added alternative label update AltLabel (USA National Phenology Network, U.S. Geological Survey, U.S. Department of the Interior);
in scheme: providers

USGS
type: Concept