NCEP-NAM
type: Concept
in scheme: platforms
change note: 2015-03-05 11:03:59.0 [epneff] Insert Concept add broader relation (NCEP-NAM [4cbc6cbe-50a2-4464-acd9-395379753d4e,106783] - Models/Analyses [113ecbc2-ab36-4d58-a96c-a6ce0106e749,73395]);
change note: 2015-03-05 11:04:51.0 [epneff] insert AltLabel (id: null text: NCEP North American Model language code: en);
change note: 2022-03-11 14:00:27.0 [tstevens] insert Definition (id: null text: The North American Mesoscale Forecast System (NAM) is one of the National Centers For Environmental Prediction’s (NCEP) major models for producing weather forecasts. NAM generates multiple grids (or domains) of weather forecasts over the North American continent at various horizontal resolutions. Each grid contains data for dozens of weather parameters, including temperature, precipitation, lightning, and turbulent kinetic energy. NAM uses additional numerical weather models to generate high-resolution forecasts over fixed regions, and occasionally to follow significant weather events like hurricanes. language code: en);
change note: 2021-11-30 13:27:58.0 [tstevens] Move Concepts delete broader relation (null); add broader relation (NCEP-NAM [4cbc6cbe-50a2-4464-acd9-395379753d4e,826223] - Models [0a184cdc-c074-4946-90a6-02f03c686341,835911]);
definition: The North American Mesoscale Forecast System (NAM) is one of the National Centers For Environmental Prediction’s (NCEP) major models for producing weather forecasts. NAM generates multiple grids (or domains) of weather forecasts over the North American continent at various horizontal resolutions. Each grid contains data for dozens of weather parameters, including temperature, precipitation, lightning, and turbulent kinetic energy. NAM uses additional numerical weather models to generate high-resolution forecasts over fixed regions, and occasionally to follow significant weather events like hurricanes.

Models
type: Concept