UC-BERKELEY/ESML
in scheme: providers
definition: The University of California, Berkeley Earth Science and Map Library houses informative Earth science information collections, map collections, aerial photographs, geography, climate, and GIS related collections. There is an in depth online inventory that users can look at. Website: "http://www.lib.berkeley.edu/EART/"
type: Concept

ACADEMIC
type: Concept