SP
in scheme: projects
definition: Sirenian International is a grassroots organization of people from around the world who share a dedication to manatee and dugong research, education, and conservation. Summary provided by http://www.sirenian.org/
type: Concept

S - U
type: Concept