CLOUD PROPERTIES
type: Concept

CLOUD TOP TEMPERATURE
change note: 2013-02-14 13:44:15.0 [mpmorahan] Move Concepts add broader relation (CLOUD TOP TEMPERATURE [4dc3fcab-a947-47b9-b9a1-acb2a23ee478,62401] - CLOUD PROPERTIES [c9e429cb-eff0-4dd3-9eca-527e0081f65c,82133]); delete broader relation (null);
in scheme: sciencekeywords
definition: Atmospheric temperature observed at the top of a cloud.
type: Concept