NOAA
type: Concept

IOOS
change note: 2013-04-12 13:09:19.0 [sgrebas] Insert Concept add broader relation (IOOS [4e13905f-c97c-44f7-b5c9-b89282005b4c,83275] - NOAA [c9003d36-020d-4e86-995a-498945576c23,66509]);
in scheme: providers
definition: The Integrated Ocean Observing System (IOOS) is a national-regional partnership working to provide new tools and forecasts to improve safety, enhance the economy, and protect our environment. Integrated ocean information is now available in near real time, as well as retrospectively. Easier and better access to this information is improving our ability to understand and predict coastal events - such as storms, wave heights, and sea level change. Such knowledge is needed for everything from retail to development planning.
type: Concept