IPHEx
change note: 2017-08-10 15:41:46.0 [sritz] insert AltLabel (id: null category: primary text: Integrated Precipitation and Hydrology Experiment language code: en); insert Definition (id: null text: The Integrated Precipitation and Hydrology Experiment (IPHEx) field campaign was conducted in North Carolina during the months of April thru June 2014. IPHEx sought to characterize warm season orographic precipitation regimes, and the relationship between precipitation regimes and hydrologic processes in regions of complex terrain. language code: en);
change note: 2017-08-10 15:40:39.0 [sritz] Insert Concept add broader relation (IPHEx [4e5d740a-2143-49d3-b11c-0af552cf525c,309883] - G - I [af0968ce-ffe3-44a0-86de-2ec9b9a8fa5d,294133]);
in scheme: projects
definition: The Integrated Precipitation and Hydrology Experiment (IPHEx) field campaign was conducted in North Carolina during the months of April thru June 2014. IPHEx sought to characterize warm season orographic precipitation regimes, and the relationship between precipitation regimes and hydrologic processes in regions of complex terrain.
type: Concept

G - I
type: Concept