AU/BOM/NTRO
in scheme: providers
definition: This data center is the Northern Territory Regional Office of the Bureau of Meteorology which provides many of the same meteorological services as the other regional centers. Website: "http://www.bom.gov.au/weather/nt/"
type: Concept

AUSTRALIA
type: Concept