CLAP
change note: 2021-05-18 15:35:40.0 [sritz] insert AltLabel (id: null category: primary text: Continuous Light Absorption Photometer language code: en);
change note: 2021-05-18 15:36:42.0 [sritz] insert Definition (id: null text: Based on experience gained from years of operating commercial instruments continuously at field sites and intermittently in laboratory studies, staff at GMD designed a new instrument, the Continuous Light Absorption Photometer (CLAP), to be functionally comparable to a widely-used commercial instrument, the Particle/Soot Absorption Photometer (PSAP), but that did not suffer from the same operating limitations as the PSAP. The choice of a functionally comparable design to the PSAP allowed measurements from the CLAP to use the well-established PSAP correction schemes that account for know imperfections in all filter-based absorption measurements. language code: en);
change note: 2021-05-18 15:35:19.0 [sritz] Insert Concept add broader relation (CLAP [4eabba21-47c2-4042-986d-d200d0ae2dd9,621141] - Photometers [f66daf4f-4d71-49a0-9d3d-205dc7f1faed,614049]);
type: Concept
in scheme: instruments
definition: Based on experience gained from years of operating commercial instruments continuously at field sites and intermittently in laboratory studies, staff at GMD designed a new instrument, the Continuous Light Absorption Photometer (CLAP), to be functionally comparable to a widely-used commercial instrument, the Particle/Soot Absorption Photometer (PSAP), but that did not suffer from the same operating limitations as the PSAP. The choice of a functionally comparable design to the PSAP allowed measurements from the CLAP to use the well-established PSAP correction schemes that account for know imperfections in all filter-based absorption measurements.

Photometers
type: Concept