Pressure/Height Meters
type: Concept

CS100 Barometric Pressure Sensor
change note: 2021-08-09 08:37:03.0 [tstevens] insert AltLabel (id: null category: primary text: Campbell Scientific CS100 Barometric Pressure Sensor language code: en); insert Definition (id: null text: The CS100 measures barometric pressure for the range of 600 to 1100 hPa (mBar). This range equates to from below sea level (as in a mine) up to 12,000 feet above sea level. Designed for use in environmental applications, the CS100 is compatible with all Campbell Scientific data loggers. language code: en);
change note: 2021-08-09 08:35:31.0 [tstevens] Insert Concept add broader relation (CS100 Barometric Pressure Sensor [4ee1d597-41e4-4e44-bc80-66b4b7c8d86b,706552] - Pressure/Height Meters [b5f5efbe-5b2a-405d-b1ea-ab6c90028009,698987]);
in scheme: instruments
definition: The CS100 measures barometric pressure for the range of 600 to 1100 hPa (mBar). This range equates to from below sea level (as in a mine) up to 12,000 feet above sea level. Designed for use in environmental applications, the CS100 is compatible with all Campbell Scientific data loggers.
type: Concept