DESERT SCRUB
change note: 2016-06-13 12:20:29.0 [gee-cee] insert Definition (id: null text: Pertaining to an area between 15 and 35 degrees N & S characterized by less than 300 mm annual rainfall and consisting of vegetation adapted to hot, dry conditions. language code: en);
change note: 2016-06-13 12:19:56.0 [gee-cee] Insert Concept add broader relation (DESERT SCRUB [4f63746e-0e8b-4254-9d4a-a23a852f819f,188191] - DESERTS [5d5426f6-e7ce-41c1-a3d3-b93adf748f0f,85131]);
in scheme: sciencekeywords
definition: Pertaining to an area between 15 and 35 degrees N & S characterized by less than 300 mm annual rainfall and consisting of vegetation adapted to hot, dry conditions.
type: Concept

DESERTS
type: Concept