BCI
in scheme: projects
definition: The mission of Bat Conservation International is to protect and restore bats and their habitats worldwide. It was founded in 1982, as scientists around the world became concerned that bats essential to the balance of nature and human economies were in alarming decline. Under the founding guidance of Dr. Merlin Tuttle, an internationally recognized authority on bats, the organization has achieved unprecedented progress by emphasizing sustainable uses of natural resources that benefit both bats and people. For more information, link to "http://www.batcon.org/"
type: Concept

A - C
type: Concept