NON-GOVERNMENT/NON-PROFIT ORGANIZATIONS
type: Concept

CVAG
in scheme: providers
definition: * CVAG was formed in 1973 under California's Joint Powers Law to address issues of valley-wide significance. * Today, CVAG works on a variety of projects important to the Coachella Valley, both as the lead agency and as part of larger teams. Summary Provided By: http://www.cvag.org/Contact_Us.htm
type: Concept