ATMOSPHERIC RADIATION
type: Concept

NET RADIATION
in scheme: sciencekeywords
definition: Net radiation refers to the difference between the downward and upward (total and terrestrial) radiation. The net flux of all radiations. Canalso refer to the net solar radiation which is the difference between the sola\\ r radiations directed downwards and upwards.
type: Concept