NASA
type: Concept

NASA/GSFC/SED/ESD/ESISL/GESDISC
change note: 2023-03-16 14:26:25.0 [sritz] update AltLabel (Goddard Earth Sciences Data and Information Services Center (formerly Goddard DAAC), Earth Science Information Systems Laboratory, Earth Sciences Division, Science and Exploration Directorate, Goddard Space Flight Center, NASA); update PrefLabel (NASA/GSFC/SED/ESD/ESISL/GESDISC); update Resource (provider);
change note: 2017-06-12 14:04:58.0 [sritz] update Definition (https://disc.gsfc.nasa.gov/);
change note: 2017-06-08 16:38:50.0 [sritz] update Definition (The Goddard Space Flight Center Earth Sciences Data and Information Services Center (GES-DISC), Greenbelt, Maryland, is one of several Earth science data centers comprising the Earth Science Data and Information System (ESDIS). The ESDIS program is a segment of the Earth Observing System (EOS), NASA's contribution to the Global Change Research Program. The GES-DISC is an interactive scientific data management system composed of an integrated set of software tools for locating and accessing data from NASA and other correlative research missions in upper atmosphere, atmospheric dynamics, and global biosphere disciplines. The DISC provides comprehensive information about available data and offers flexible access to a number of valuable data sets from both satellite and conventional sources. https://disc.gsfc.nasa.gov/ Contact: Voice: 301-614-5224 Fax: 301-614-5268 E-mail: gsfc-help-disc@lists.nasa.gov);
change note: 2023-03-16 14:38:52.0 [sritz] update Definition (The Goddard Space Flight Center Earth Sciences Data and Information Services Center (GES-DISC), Greenbelt, Maryland, is one of several Earth science data centers comprising the Earth Science Data and Information System (ESDIS). The ESDIS program is a segment of the Earth Observing System (EOS), NASA's contribution to the Global Change Research Program. The GES-DISC is an interactive scientific data management system composed of an integrated set of software tools for locating and accessing data from NASA and other correlative research missions in upper atmosphere, atmospheric dynamics, and global biosphere disciplines. The DISC provides comprehensive information about available data and offers flexible access to a number of valuable data sets from both satellite and conventional sources. https://disc.gsfc.nasa.gov/ Contact: Voice: 301-614-5224 Fax: 301-614-5268 E-mail: gsfc-dl-help-disc@mail.nasa.gov);
definition: The Goddard Space Flight Center Earth Sciences Data and Information Services Center (GES-DISC), Greenbelt, Maryland, is one of several Earth science data centers comprising the Earth Science Data and Information System (ESDIS). The ESDIS program is a segment of the Earth Observing System (EOS), NASA's contribution to the Global Change Research Program. The GES-DISC is an interactive scientific data management system composed of an integrated set of software tools for locating and accessing data from NASA and other correlative research missions in upper atmosphere, atmospheric dynamics, and global biosphere disciplines. The DISC provides comprehensive information about available data and offers flexible access to a number of valuable data sets from both satellite and conventional sources. https://disc.gsfc.nasa.gov/ Contact: Voice: 301-614-5224 Fax: 301-614-5268 E-mail: gsfc-dl-help-disc@mail.nasa.gov
in scheme: providers
type: Concept