EPA/MAIA
in scheme: providers
definition: The Mid-Atlantic Integrated Assessment (MAIA) is a research, monitoring, and assessment program in the Mid-Atlantic region. MAIA is a partnership of federal, state and local governments; Non-Governmental organizations (NGOs); and academic institutions. MAIA's goal is to provide integrated scientific knowledge to support the environmental decision-making process for the Mid-Atlantic region. This includes development and implementation of multi-scale monitoring designs, scientific tools, and high-quality data. Website: "http://www.epa.gov/maia/" [Summary provided by the EPA.]
type: Concept

EPA
type: Concept