SEA SURFACE TOPOGRAPHY
type: Concept

SEA SURFACE SLOPE
in scheme: sciencekeywords
definition: The slope of the ocean water surface, resultant from a geophysical phenomenon such as dynamic circulation or tides. This variable does not refer to wave slope.
type: Concept