Radio
type: Concept

TELEMETER
in scheme: instruments
definition: A TELEMETER is any scientific instrument for observing events at a distance and transmitting the information back to the observer.
type: Concept