SLU/SOILS
in scheme: providers
definition: SLU’s knowledge is an important component in many things that people take for granted. Whether it is the food we eat, or the animals we either husband on our farms or love as pets, or the forests that we wander in - all are subjects of SLU’s attention. Summary Provided By: http://www.slu.se/?ID=171
type: Concept

ACADEMIC
type: Concept