WATER CHARACTERISTICS
type: Concept

EUTROPHICATION
change note: 2018-03-07 11:11:30.0 [tstevens] insert Definition (id: null text: The enrichment of an ecosystem with chemical nutrients, typically compounds containing nitrogen, phosphorus, or both. language code: en);
change note: 2018-03-07 08:33:29.0 [tstevens] Insert Concept add broader relation (EUTROPHICATION [53d36c39-3cb1-44db-9746-feee86cbe9d7,310699] - WATER CHARACTERISTICS [f7e97dc3-1181-41b5-8b90-946eb2504110,310633]);
in scheme: sciencekeywords
definition: The enrichment of an ecosystem with chemical nutrients, typically compounds containing nitrogen, phosphorus, or both.
type: Concept