METEORITE PHYSICAL/OPTICAL PROPERTIES
type: Concept

REFLECTION
change note: 2017-03-10 07:53:19.0 [tstevens] insert Definition (id: null text: A method of exploration geophysics that uses the principles of seismology to estimate of the properties of the Earth's subsurface from reflected seismic waves. This measurement is also known as seismic reflection. language code: en);
change note: 2013-03-07 08:13:36.0 [tbs1979] Insert Concept add broader relation (REFLECTION [547c2bee-40ce-4b23-8338-5fa7c6ad8a8d,83109] - METEORITE PHYSICAL/OPTICAL PROPERTIES [3ff47a50-2f58-489b-96a7-74e1d40cf0f2,83087]);
in scheme: sciencekeywords
definition: A method of exploration geophysics that uses the principles of seismology to estimate of the properties of the Earth's subsurface from reflected seismic waves. This measurement is also known as seismic reflection.
type: Concept