ARK-X/2
in scheme: projects
definition: The aim of the marine gravity measurements of the ARK-V/3b was to map the crustal structure of totally different geological units in a region of close proximity and map the sedimentary distribution and the western boundary of the Mesozoic sediment basin of Jameson Land.
type: Concept

A - C
type: Concept